lp:zeitgeist

Created by Siegfried Gevatter and last modified
Get this branch:
bzr branch lp:zeitgeist

Branch merges

Related bugs

Related blueprints

Branch information

Owner:
Zeitgeist Framework Team
Project:
Zeitgeist Framework
Status:
Mature

Import details

Import Status: Reviewed

This branch is an import of the HEAD branch of the Git repository at git://anongit.freedesktop.org/zeitgeist/zeitgeist.

The next import is scheduled to run .

Last successful import was .

Import started on alnitak and finished taking 10 seconds — see the log
Import started on alnitak and finished taking 10 seconds — see the log
Import started on alnitak and finished taking 10 seconds — see the log
Import started on alnitak and finished taking 10 seconds — see the log
Import started on izar and finished taking 10 seconds — see the log
Import started on alnitak and finished taking 10 seconds — see the log
Import started on izar and finished taking 10 seconds — see the log
Import started on alnitak and finished taking 10 seconds — see the log
Import started on alnitak and finished taking 10 seconds — see the log
Import started on izar and finished taking 5 seconds — see the log

Recent revisions

799. By Rico Tzschichholz on 2020-12-30

Sync custom g_assert_cmp* bindings with vala 0.52 and use them as needed

798. By Rico Tzschichholz on 2020-12-30

Fix syntax of namespace documentation block

797. By Rico Tzschichholz on 2020-12-30

Use GenericArray API only

796. By Rico Tzschichholz on 2020-10-15

Release 1.0.3

795. By Rico Tzschichholz on 2020-10-15

Update bugtracker links

794. By crvi on 2020-08-13

test: fix ResourceWarning: unclosed file errors

793. By crvi on 2020-08-13

test: fix incorrect process reporting

reports the grep process rather than that of zeitgeist-daemon

792. By crvi on 2020-08-13

test: fix ZeitgeistRemoteInterfaceTest::testQuit test failure

======================================================================
ERROR: testQuit (remote-test.ZeitgeistRemoteInterfaceTest)
Calling Quit() on the remote interface should shutdown the
----------------------------------------------------------------------
Traceback (most recent call last):
  File "zeitgeist/test/dbus/remote-test.py", line 500, in testQuit
    self.client._iface.Quit()
  File "test/dbus/../../zeitgeist/client.py", line 132, in _ProxyMethod
    return self._disconnection_safe(
  File "test/dbus/../../zeitgeist/client.py", line 122, in _disconnection_safe
    return reconnecting_error_handler(e)
  File "test/dbus/../../zeitgeist/client.py", line 120, in _disconnection_safe
    return method_getter()(*args, **kwargs)
  File "/usr/lib/python3/dist-packages/dbus/proxies.py", line 141, in __call__
    return self._connection.call_blocking(self._named_service,
  File "/usr/lib/python3/dist-packages/dbus/connection.py", line 652, in call_blocking
    reply_message = self.send_message_with_reply_and_block(
dbus.exceptions.DBusException: org.freedesktop.DBus.Error.NoReply: Message recipient disconnected from message bus without replying

791. By crvi on 2020-08-13

test: fix testResultTypesMostRecentEvents and testResultTypesLeastRecentEvents test failures

======================================================================
ERROR: testResultTypesLeastRecentEvents (result-types-test.ResultTypeTest)
----------------------------------------------------------------------
Traceback (most recent call last):
  File "zeitgeist/test/dbus/result-types-test.py", line 57, in testResultTypesLeastRecentEvents
    event.id for event in sorted(events,
TypeError: 'cmp' is an invalid keyword argument for sort()

======================================================================
ERROR: testResultTypesMostRecentEvents (result-types-test.ResultTypeTest)
----------------------------------------------------------------------
Traceback (most recent call last):
  File "zeitgeist/test/dbus/result-types-test.py", line 41, in testResultTypesMostRecentEvents
    event.id for event in sorted(events,
TypeError: 'cmp' is an invalid keyword argument for sort()

790. By crvi on 2020-08-13

test: fix testEventWithBinaryPayload test failure

======================================================================
FAIL: testEventWithBinaryPayload (engine-test.ZeitgeistEngineTest)
----------------------------------------------------------------------
Traceback (most recent call last):
  File "zeitgeist/test/dbus/engine-test.py", line 425, in testEventWithBinaryPayload
    self.assertEqual(event.payload, result.payload)
AssertionError: b'\n\t\t<Content name="Telepathy" class="[222 chars]ent>' != '\n\t\t<Content name="Telepathy" class="T[221 chars]ent>'

Branch metadata

Branch format:
Branch format 7
Repository format:
Bazaar repository format 2a (needs bzr 1.16 or later)
This branch contains Public information 
Everyone can see this information.