~oem-solutions-engineers/pc-enablement/+git/oem-scripts:master

Last commit made on 2024-05-27
Get this branch:
git clone -b master https://git.launchpad.net/~oem-solutions-engineers/pc-enablement/+git/oem-scripts
Members of OEM Solutions Group: Engineers can upload to this branch. Log in for directions.

Branch merges

Branch information

Recent commits

b17eb0f... by OEM Taipei Bot

Merge #466418 from ~kchsieh/pc-enablement/+git/oem-scripts:master

Approved by:
Artur Pak (artur-at-work)

3e9b81b... by Kai-Chuan Hsieh

image-deploy.sh: Add capability to get image from oem-share

57f05f1... by Shih-Yuan Lee

releasing package oem-scripts version 2.4

18a867b... by OEM Taipei Bot

Merge #466368 from ~fourdollars/pc-enablement/+git/oem-scripts:master

Approved by:
Kai-Chuan Hsieh (kchsieh)

9ddbb0b... by Shih-Yuan Lee

black bootstrap-meta and mir-bug.

9c495b8... by OEM Taipei Bot

Merge #466362 from ~kchsieh/pc-enablement/+git/oem-scripts:master

Approved by:
Shih-Yuan Lee (fourdollars)

71eb7ed... by Kai-Chuan Hsieh

releasing package oem-scripts version 2.3

3af1d4c... by Kai-Chuan Hsieh

Add image-deploy.sh to shellcheck test

d14e62a... by OEM Taipei Bot

Merge #466279 from ~kchsieh/pc-enablement/+git/oem-scripts:master

Approved by:
Shih-Yuan Lee (fourdollars)

3de1e07... by Kai-Chuan Hsieh

Fix flake8 type compare error

135s make[1]: Entering directory '/tmp/autopkgtest.6mfJSd/build.EjF/real-tree'
135s ./tests/test_black
139s ./tests/test_flake8
140s bug-bind.py:99:12: E721 do not compare types, for exact checks use `is` / `is not`, for instance checks use `isinstance()`
140s mir-bug:1282:8: E721 do not compare types, for exact checks use `is` / `is not`, for instance checks use `isinstance()`
140s mir-bug:1284:10: E721 do not compare types, for exact checks use `is` / `is not`, for instance checks use `isinstance()`
140s make[1]: *** [debian/rules:16: override_dh_auto_test] Error 1
140s make[1]: Leaving directory '/tmp/autopkgtest.6mfJSd/build.EjF/real-tree'
140s make: *** [debian/rules:9: build] Error 2
140s dpkg-buildpackage: error: debian/rules build subprocess returned exit status 2
140s blame: .
140s badpkg: rules build failed with exit code 2
140s autopkgtest [03:14:26]: ERROR: erroneous package: rules build failed with exit code 2