Code review comment for lp:~gordallott/unity/hud

Mirco Müller (macslow) wrote :

Getting this error during compilation atm:

CMakeFiles/test-gtest-dbus.dir/test_hud.cpp.o: In function `TestBody':
/tmp/fasel/unity/tests/test_hud.cpp:30: undefined reference to `unity::hud::Hud::Hud(std::basic_string<char, std::char_traits<char>, std::allocator<char> > const&, std::basic_string<char, std::char_traits<char>, std::allocator<char> > const&)'
/tmp/fasel/unity/tests/test_hud.cpp:93: undefined reference to `unity::hud::Hud::RequestQuery(std::basic_string<char, std::char_traits<char>, std::allocator<char> > const&)'
/tmp/fasel/unity/tests/test_hud.cpp:100: undefined reference to `unity::hud::Hud::CloseQuery()'
collect2: ld returned 1 exit status
make[2]: *** [tests/test-gtest-dbus] Error 1
make[1]: *** [tests/CMakeFiles/test-gtest-dbus.dir/all] Error 2
make: *** [all] Error 2

review: Needs Fixing

« Back to merge proposal