Launchpad.net

lgw01-amd64-010

lgw01-amd64-010 builds amd64 and i386 binaries and is owned by William Grant.

View full history Current status

20859767 [building] Building amd64 build of pygobject 3.29.2-1 in ubuntu cosmic RELEASE [~pythoneers/ubuntu/py37-rebuilds]

Started 1 day, 20 hours, 33 minutes, 57.6 seconds ago.

Buildlog

l -Wstrict-prototypes -Wdate-time -D_FORTIFY_SOURCE=2 -g -fdebug-prefix-map=/build/python2.7-vpJHDw/python2.7-2.7.15=. -fstack-protector-strong -Wformat -Werror=format-security -Wl,-Bsymbolic-functions -Wl,-z,relro -Wl,-z,now -Wl,--as-needed -g -O2 -fdebug-prefix-map=/<<PKGBUILDDIR>>=. -fstack-protector-strong -Wformat -Werror=format-security -Wdate-time -D_FORTIFY_SOURCE=2 build/pygobject_tests/temp.linux-amd64-2.7/<<PKGBUILDDIR>>/tests/testhelpermodule.o build/pygobject_tests/temp.linux-amd64-2.7/<<PKGBUILDDIR>>/tests/test-floating.o build/pygobject_tests/temp.linux-amd64-2.7/<<PKGBUILDDIR>>/tests/test-thread.o build/pygobject_tests/temp.linux-amd64-2.7/<<PKGBUILDDIR>>/tests/test-unknown.o -lglib-2.0 -lgio-2.0 -lgobject-2.0 -lcairo -o build/pygobject_tests/lib.linux-amd64-2.7/tests/testhelper.so
copying build/pygobject_tests/lib.linux-amd64-2.7/tests/testhelper.so -> tests
I: pybuild base:217: cd /<<PKGBUILDDIR>>/.pybuild/cpython2_2.7/build; python2.7 -m pytest tests
============================= test session starts ==============================
platform linux2 -- Python 2.7.15, pytest-3.6.4, py-1.5.4, pluggy-0.6.0
rootdir: /<<PKGBUILDDIR>>, inifile:
collected 1374 items

tests/test_atoms.py ....... [ 0%]
tests/test_cairo.py ......................... [ 2%]
tests/test_docstring.py ...............x. [ 3%]
tests/test_error.py ............... [ 4%]
tests/test_everything.py Trace/breakpoint trap (core dumped)
E: pybuild pybuild:338: test: plugin distutils failed with: exit code=133: cd /<<PKGBUILDDIR>>/.pybuild/cpython2_2.7/build; python2.7 -m pytest tests
dh_auto_test: pybuild --test --test-pytest -i python{version} -p 2.7 returned exit code 13
make[1]: *** [debian/rules:29: override_dh_auto_test] Error 1
make[1]: Leaving directory '/<<PKGBUILDDIR>>'
make: *** [debian/rules:22: binary] Error 2
dpkg-buildpackage: error: debian/rules binary subprocess returned exit status 2

Builder information

Architectures:
amd64 i386 (virtual)
Location:
http://lgw01-amd64-010.vbuilder.lgw01.scalingstack:8221/
Owner:
William Grant
Mode:
This builder is in auto-mode and accepting jobs from the auto-build system.
Version:
163